{"text_format":"1","workbook":"xlsx","n_sheets":2,"sheets":["Sheet1","Sheet2"],"not_rendered":{"charts":0,"images":0,"macros":1,"external_links":0,"defined_names":7,"comments":1,"pivot_tables":0},"unopened":[],"bounds":{"document_bytes":16777216,"sheet_cells":100000,"rows_first":2000,"rows_last":500,"rows_between":2000,"halvings":0,"cell_chars":16384,"cell_head_chars":4096},"cells_cut":0,"cells_raw":0,"read":"whole","date_system":"1900"}

{"sheet":"Sheet1","index":0,"n_rows":5,"n_cols":19,"rows_kept":5,"cut":false,"hidden":false,"merged":[]}
[null,null,null,null,null,null,null,null,null,null,"カウンタ",6,"印刷範囲","A1:I20",null,"顧客名",{"$f":"VLOOKUP(カウンタ,Sheet2!$A$1:$H$305,3,0)","v":"海産物研究所"}]
[null,null,null,null,null,null,null,null,null,null,"印刷開始番号",1,null,null,null,"部課名",{"$f":"VLOOKUP(カウンタ,Sheet2!$A$1:$H$305,4,0)&\" \"&R2","v":"購買課 御中"},"御中"]
[null,null,null,null,null,null,null,null,null,null,null,null,null,null,null,"請求金額",{"$f":"R3&TEXT(VLOOKUP(カウンタ,Sheet2!$A$1:$H$305,5,0),\"#,##0\")&\" \"&S3","v":"￥480,000 円也"},"￥","円也"]
[null,null,null,null,null,null,null,null,null,null,null,null,null,null,null,"日付",{"$f":"VLOOKUP(カウンタ,Sheet2!$A$1:$H$305,6,0)","v":"2013-05-27"}]
[null,null,null,null,null,null,null,null,null,null,"印刷終了番号",6,null,null,null,"印刷区分",{"$f":"VLOOKUP(カウンタ,Sheet2!$A$1:$H$305,7,0)","v":"〇"}]

{"sheet":"Sheet2","index":1,"n_rows":7,"n_cols":8,"rows_kept":7,"cut":false,"hidden":false,"merged":[]}
["№","顧客№","顧客名","部課名","請求額","日付","印刷区分","備考"]
[1,20020501,"日本株式会社","経理課",120000,"2013-05-27","〇"]
[2,20020203,"埼玉基礎研究所","総務課",2250000,"2013-05-31"]
[3,20030118,"日本海産業株式会社","販売課",250000,"2013-05-27","〇"]
[4,20030212,"琵琶湖電業株式会社","施設課",125000,"2013-05-27","〇"]
[5,20040506,"海洋電気株式会社","経理課",250000,"2013-05-27","〇"]
[6,20040613,"海産物研究所","購買課",480000,"2013-05-27","〇"]