{"text_format":"1","workbook":"xlsx","n_sheets":4,"sheets":["使用方法","祝日","A4カレンダー","FLｹｰｽ用カレンダー"],"not_rendered":{"charts":0,"images":5,"macros":1,"external_links":0,"defined_names":2,"comments":3,"pivot_tables":0},"unopened":[],"bounds":{"document_bytes":16777216,"sheet_cells":100000,"rows_first":2000,"rows_last":500,"rows_between":2000,"halvings":0,"cell_chars":16384,"cell_head_chars":4096},"cells_cut":0,"cells_raw":0,"read":"whole","date_system":"1900"}

{"sheet":"使用方法","index":0,"n_rows":86,"n_cols":12,"rows_kept":86,"cut":false,"hidden":false,"merged":[[0,9,0,10]]}
[null,"AUTOカレンダーの使い方",null,null,"AUTO_CL2 Ver.19.42",null,null,"Written by K.Kishida",null,"info@melpaso.com",null,"2019.12.03"]
[null,"　　Excel 2007以上に対応"]
[null,"はじめに"]
[null,"この“AUTOカレンダー”は、印刷とその範囲自動設定を除いて、関数だけを使用して制作されたものです。「万年カレンダー」は、関数だけでもこれ"]
[null,"だけのことが出来るという良い例だと思います。"]
[null,"それで、“AUTOカレンダー”は、ある程度関数を使用してきた人にとってもこれから関数を学ぼうと思っている人にとっても興味を持っていただけるの"]
[null,"ではないかと思います。"]
[]
[null,"“AUTOカレンダー”には、年数制限のあるカレンダーファイルと、年数制限の無い“万年カレンダー”の2種類あります。"]
[null,"年数制限のある“AUTOカレンダー”は毎年サイトからダウンロードして無料で使えます。（今年のファイルは Version 19.42 です）"]
{"$rows_left_out":77}
{"sheet":"祝日","index":1,"n_rows":33,"n_cols":5,"rows_kept":33,"cut":false,"hidden":false,"merged":[[32,0,32,1],[1,0,1,5],[30,0,30,5]]}
[null,"イベント・祝日記入欄"]
[]
[2020]
[]
[null,"日付記入欄",null,"祝日・その他","備考"]
[null,"2019-01-01",{"$f":"IF(B6=\"\",\"\",DATE($A$3,MONTH(B6),DAY(B6)))","v":"2020-01-01"},"元旦"]
[null,null,"","成人の日","1月の第二月曜日"]
[null,"2019-02-11","2020-02-11","建国記念の日"]
[null,"2019-02-23","2020-02-23","天皇誕生日"]
[null,"2019-03-21",{"$f":"IF(B10=\"\",\"\",DATE($A$3,MONTH(B10),DAY(B10)))","v":"2020-03-21"},"春分の日"]
{"$rows_left_out":24}
{"sheet":"A4カレンダー","index":2,"n_rows":18,"n_cols":15,"rows_kept":18,"cut":false,"hidden":false,"merged":[[16,11,16,12],[2,13,3,13],[13,11,13,12],[11,13,12,13],[16,13,16,14],[2,14,3,14],[8,13,9,13],[8,14,9,14],[10,13,10,14],[11,11,12,11],[11,12,12,12],[14,11,15,11],[14,12,15,12],[11,14,12,14],[13,13,13,14],[14,13,15,13],[14,14,15,14],[4,13,4,14],[7,11,7,12],[10,11,10,12],[5,13,6,13],[5,14,6,14],[7,13,7,14],[4,11,4,12],[19,1,19,2],[2,9,3,9],[2,10,3,10],[4,9,4,10],[5,9,6,9],[5,10,6,10],[7,9,7,10],[8,9,9,9],[8,10,9,10],[10,9,10,10],[11,9,12,9],[11,10,12,10],[13,9,13,10],[14,9,15,9],[14,10,15,10],[16,9,16,10],[13,3,13,4],[14,3,15,3],[14,4,15,4],[16,3,16,4],[17,3,18,3],[17,4,18,4],[19,3,19,4],[2,1,3,1],[13,1,13,2],[14,1,15,1],[14,2,15,2],[16,1,16,2],[17,1,18,1],[17,2,18,2],[4,3,4,4],[5,3,6,3],[5,4,6,4],[7,3,7,4],[8,3,9,3],[8,4,9,4],[10,3,10,4],[11,3,12,3],[11,4,12,4],[4,1,4,2],[5,1,6,1],[5,2,6,2],[7,1,7,2],[8,1,9,1],[8,2,9,2],[10,1,10,2],[11,1,12,1],[11,2,12,2],[13,7,13,8],[14,7,15,7],[14,8,15,8],[16,7,16,8],[2,5,3,5],[2,6,3,6],[4,5,4,6],[5,5,6,5],[5,6,6,6],[7,5,7,6],[8,5,9,5],[8,6,9,6],[10,5,10,6],[11,5,12,5],[11,6,12,6],[13,5,13,6],[14,5,15,5],[14,6,15,6],[16,5,16,6],[4,7,4,8],[2,8,3,8],[5,7,6,7],[5,8,6,8],[7,7,7,8],[10,7,10,8],[11,7,12,7],[11,8,12,8],[1,9,1,10],[1,11,1,12],[1,13,1,14],[1,1,1,2],[1,3,1,4],[1,5,1,6],[1,7,1,8],[2,2,3,2],[5,11,6,11],[5,12,6,12],[8,11,9,11],[8,12,9,12],[0,7,0,8],[2,7,3,7],[0,3,0,4],[2,3,3,3],[2,4,3,4],[2,11,3,11],[2,12,3,12],[8,7,9,7],[8,8,9,8]]}
[null,null,null,{"$f":"祝日!A3","v":2020},null,null,null,7]
[null,"月",null,"火",null,"水",null,"木",null,"金",null,"土",null,"日"]
[null,{"$f":"IF(WEEKDAY(DATE($D$1,$H$1,1))=2,1,\"\")","v":""},{"$f":"IF(ISERROR(VLOOKUP(DATE($D$1,$H$1,B3),祝日!$C$6:$D$28,2,0)),\"\",VLOOKUP(DATE($D$1,$H$1,B3),祝日!$C$6:$D$28,2,0))","v":""},{"$f":"IF(WEEKDAY(DATE($D$1,$H$1,1))=3,1,IF(B3<>\"\",B3+1,\"\"))","v":""},{"$f":"IF(ISERROR(VLOOKUP(DATE($D$1,$H$1,D3),祝日!$C$6:$D$28,2,0)),\"\",VLOOKUP(DATE($D$1,$H$1,D3),祝日!$C$6:$D$28,2,0))","v":""},{"$f":"IF(WEEKDAY(DATE($D$1,$H$1,1))=4,1,IF(D3<>\"\",D3+1,\"\"))","v":1},{"$f":"IF(ISERROR(VLOOKUP(DATE($D$1,$H$1,F3),祝日!$C$6:$D$28,2,0)),\"\",VLOOKUP(DATE($D$1,$H$1,F3),祝日!$C$6:$D$28,2,0))","v":""},{"$f":"IF(WEEKDAY(DATE($D$1,$H$1,1))=5,1,IF(F3<>\"\",F3+1,\"\"))","v":2},{"$f":"IF(ISERROR(VLOOKUP(DATE($D$1,$H$1,H3),祝日!$C$6:$D$28,2,0)),\"\",VLOOKUP(DATE($D$1,$H$1,H3),祝日!$C$6:$D$28,2,0))","v":""},{"$f":"IF(WEEKDAY(DATE($D$1,$H$1,1))=6,1,IF(H3<>\"\",H3+1,\"\"))","v":3},{"$f":"IF(ISERROR(VLOOKUP(DATE($D$1,$H$1,J3),祝日!$C$6:$D$28,2,0)),\"\",VLOOKUP(DATE($D$1,$H$1,J3),祝日!$C$6:$D$28,2,0))","v":""},{"$f":"IF(WEEKDAY(DATE($D$1,$H$1,1))=7,1,IF(J3<>\"\",J3+1,\"\"))","v":4},{"$f":"IF(ISERROR(VLOOKUP(DATE($D$1,$H$1,L3),祝日!$C$6:$D$28,2,0)),\"\",VLOOKUP(DATE($D$1,$H$1,L3),祝日!$C$6:$D$28,2,0))","v":""},{"$f":"IF(WEEKDAY(DATE($D$1,$H$1,1))=1,1,IF(L3<>\"\",L3+1,\"\"))","v":5},{"$f":"IF(ISERROR(VLOOKUP(DATE($D$1,$H$1,N3),祝日!$C$6:$D$28,2,0)),\"\",VLOOKUP(DATE($D$1,$H$1,N3),祝日!$C$6:$D$28,2,0))","v":""}]
[]
[]
[null,{"$f":"N3+1","v":6},{"$f":"IF(AND($H$1=1,B3<>\"\"),祝日!$D$7,IF(AND($H$1=10,B3<>\"\"),祝日!D20,IF(ISERROR(VLOOKUP(DATE($D$1,$H$1,B6),祝日!$C$6:$D$28,2,0)),\"\",VLOOKUP(DATE($D$1,$H$1,B6),祝日!$C$6:$D$28,2,0))))","v":""},{"$f":"B6+1","v":7},{"$f":"IF(ISERROR(VLOOKUP(DATE($D$1,$H$1,D6),祝日!$C$6:$D$28,2,0)),\"\",VLOOKUP(DATE($D$1,$H$1,D6),祝日!$C$6:$D$28,2,0))","v":""},{"$f":"D6+1","v":8},{"$f":"IF(ISERROR(VLOOKUP(DATE($D$1,$H$1,F6),祝日!$C$6:$D$28,2,0)),\"\",VLOOKUP(DATE($D$1,$H$1,F6),祝日!$C$6:$D$28,2,0))","v":""},{"$f":"F6+1","v":9},{"$f":"IF(ISERROR(VLOOKUP(DATE($D$1,$H$1,H6),祝日!$C$6:$D$28,2,0)),\"\",VLOOKUP(DATE($D$1,$H$1,H6),祝日!$C$6:$D$28,2,0))","v":""},{"$f":"H6+1","v":10},{"$f":"IF(ISERROR(VLOOKUP(DATE($D$1,$H$1,J6),祝日!$C$6:$D$28,2,0)),\"\",VLOOKUP(DATE($D$1,$H$1,J6),祝日!$C$6:$D$28,2,0))","v":""},{"$f":"J6+1","v":11},{"$f":"IF(ISERROR(VLOOKUP(DATE($D$1,$H$1,L6),祝日!$C$6:$D$28,2,0)),\"\",VLOOKUP(DATE($D$1,$H$1,L6),祝日!$C$6:$D$28,2,0))","v":""},{"$f":"L6+1","v":12},{"$f":"IF(ISERROR(VLOOKUP(DATE($D$1,$H$1,N6),祝日!$C$6:$D$28,2,0)),\"\",VLOOKUP(DATE($D$1,$H$1,N6),祝日!$C$6:$D$28,2,0))","v":""}]
[]
[]
[null,{"$f":"N6+1","v":13},{"$f":"IF(AND($H$1=1,B3=\"\"),祝日!$D$7,IF(AND($H$1=8,B3=\"\"),祝日!$D17,IF(AND($H$1=10,B3=\"\"),祝日!$D$20,IF(AND($H$1=7,B3<>\"\"),祝日!$D$16,IF(AND($H$1=9,B3<>\"\"),祝日!$D$18,IF(ISERROR(VLOOKUP(DATE($D$1,$H$1,B9),祝日!$C$6:$D$28,2,0)),\"\",VLOOKUP(DATE($D$1,$H$1,B9),祝日!$C$6:$D$28,2,0)))))))","v":""},{"$f":"B9+1","v":14},{"$f":"IF(ISERROR(VLOOKUP(DATE($D$1,$H$1,D9),祝日!$C$6:$D$28,2,0)),\"\",VLOOKUP(DATE($D$1,$H$1,D9),祝日!$C$6:$D$28,2,0))","v":""},{"$f":"D9+1","v":15},{"$f":"IF(ISERROR(VLOOKUP(DATE($D$1,$H$1,F9),祝日!$C$6:$D$28,2,0)),\"\",VLOOKUP(DATE($D$1,$H$1,F9),祝日!$C$6:$D$28,2,0))","v":""},{"$f":"F9+1","v":16},{"$f":"IF(ISERROR(VLOOKUP(DATE($D$1,$H$1,H9),祝日!$C$6:$D$28,2,0)),\"\",VLOOKUP(DATE($D$1,$H$1,H9),祝日!$C$6:$D$28,2,0))","v":""},{"$f":"H9+1","v":17},{"$f":"IF(ISERROR(VLOOKUP(DATE($D$1,$H$1,J9),祝日!$C$6:$D$28,2,0)),\"\",VLOOKUP(DATE($D$1,$H$1,J9),祝日!$C$6:$D$28,2,0))","v":""},{"$f":"J9+1","v":18},{"$f":"IF(ISERROR(VLOOKUP(DATE($D$1,$H$1,L9),祝日!$C$6:$D$28,2,0)),\"\",VLOOKUP(DATE($D$1,$H$1,L9),祝日!$C$6:$D$28,2,0))","v":""},{"$f":"L9+1","v":19},{"$f":"IF(ISERROR(VLOOKUP(DATE($D$1,$H$1,N9),祝日!$C$6:$D$28,2,0)),\"\",VLOOKUP(DATE($D$1,$H$1,N9),祝日!$C$6:$D$28,2,0))","v":""}]
[]
{"$rows_left_out":9}
{"sheet":"FLｹｰｽ用カレンダー","index":3,"n_rows":103,"n_cols":30,"rows_kept":103,"cut":false,"hidden":false,"merged":[[1,12,1,20],[2,2,2,6],[2,7,2,9],[2,11,2,15],[2,17,2,21],[2,22,2,24],[6,19,6,20],[6,21,6,22],[6,23,6,24],[6,25,6,26],[2,26,2,30],[4,2,4,3],[4,4,4,5],[4,6,4,7],[4,8,4,9],[4,10,4,11],[4,12,4,13],[4,14,4,15],[4,17,4,18],[4,27,4,28],[8,21,8,22],[8,23,8,24],[4,29,4,30],[6,27,6,28],[6,29,6,30],[8,2,8,3],[8,4,8,5],[8,6,8,7],[8,8,8,9],[8,10,8,11],[8,12,8,13],[8,14,8,15],[6,2,6,3],[6,4,6,5],[6,6,6,7],[6,8,6,9],[6,10,6,11],[6,12,6,13],[6,14,6,15],[6,17,6,18],[4,19,4,20],[4,21,4,22],[4,23,4,24],[4,25,4,26],[10,25,10,26],[8,27,8,28],[8,29,8,30],[10,27,10,28],[10,29,10,30],[12,2,12,3],[12,4,12,5],[12,6,12,7],[12,8,12,9],[12,10,12,11],[8,25,8,26],[10,2,10,3],[10,4,10,5],[10,6,10,7],[10,8,10,9],[10,10,10,11],[10,12,10,13],[10,19,10,20],[10,21,10,22],[10,23,10,24],[8,17,8,18],[10,14,10,15],[10,17,10,18],[8,19,8,20],[14,2,14,3],[14,4,14,5],[14,6,14,7],[14,8,14,9],[14,10,14,11],[14,12,14,13],[14,19,14,20],[12,12,12,13],[12,14,12,15],[12,17,12,18],[14,14,14,15],[14,17,14,18],[12,19,12,20],[14,21,14,22],[14,23,14,24],[14,25,14,26],[12,27,12,28],[12,29,12,30],[14,27,14,28],[14,29,14,30],[12,21,12,22],[12,23,12,24],[12,25,12,26],[17,17,17,25],[17,26,17,30],[16,19,16,20],[16,21,16,22],[16,23,16,24],[16,2,16,3],[16,4,16,5],[16,6,16,7],[16,8,16,9],[16,10,16,11],[16,12,16,13],[19,17,19,21],[19,22,19,24],[21,25,21,26],[16,27,16,28],[19,26,19,30],[21,2,21,3],[21,4,21,5],[21,6,21,7],[21,8,21,9],[21,10,21,11],[21,12,21,13],[21,14,21,15],[21,17,21,18],[16,25,16,26],[18,3,18,7],[18,8,18,11],[19,2,19,6],[19,7,19,9],[19,11,19,15],[16,14,16,15],[16,17,16,18],[16,29,16,30],[17,2,17,10],[17,11,17,15],[21,27,21,28],[21,29,21,30],[23,2,23,3],[23,4,23,5],[23,6,23,7],[23,8,23,9],[23,10,23,11],[23,12,23,13],[23,14,23,15],[23,29,23,30],[21,19,21,20],[21,21,21,22],[21,23,21,24],[23,25,23,26],[23,27,23,28],[23,21,23,22],[23,23,23,24],[25,25,25,26],[25,27,25,28],[25,14,25,15],[23,17,23,18],[23,19,23,20],[25,17,25,18],[25,19,25,20],[25,21,25,22],[25,29,25,30],[27,10,27,11],[27,12,27,13],[27,14,27,15],[25,23,25,24],[25,2,25,3],[25,4,25,5],[25,6,25,7],[25,8,25,9],[25,10,25,11],[25,12,25,13],[27,25,27,26],[27,27,27,28],[27,29,27,30],[29,2,29,3],[29,4,29,5],[29,6,29,7],[29,8,29,9],[29,10,29,11],[29,12,29,13],[29,14,29,15],[27,17,27,18],[27,19,27,20],[27,21,27,22],[27,23,27,24],[29,25,29,26],[29,19,29,20],[29,21,29,22],[29,23,29,24],[29,27,29,28],[29,29,29,30],[27,2,27,3],[27,4,27,5],[27,6,27,7],[27,8,27,9],[31,2,31,3],[31,4,31,5],[31,6,31,7],[31,8,31,9],[31,10,31,11],[31,12,31,13],[31,14,31,15],[29,17,29,18],[31,25,31,26],[31,27,31,28],[31,29,31,30],[33,25,33,26],[33,27,33,28],[33,29,33,30],[31,23,31,24],[34,18,34,25],[33,10,33,11],[33,12,33,13],[33,14,33,15],[31,17,31,18],[33,17,33,18],[31,19,31,20],[31,21,31,22],[33,19,33,20],[36,11,36,15],[36,17,36,21],[36,22,36,24],[36,26,36,30],[33,2,33,3],[33,4,33,5],[33,6,33,7],[36,2,36,6],[36,7,36,9],[35,3,35,7],[35,8,35,11],[34,3,34,10],[34,11,34,15],[33,8,33,9],[34,26,34,30],[33,23,33,24],[33,21,33,22],[40,23,40,24],[40,25,40,26],[38,10,38,11],[38,12,38,13],[38,14,38,15],[38,17,38,18],[38,2,38,3],[38,4,38,5],[38,6,38,7],[38,8,38,9],[38,27,38,28],[38,29,38,30],[40,27,40,28],[40,29,40,30],[42,2,42,3],[42,4,42,5],[42,6,42,7],[42,8,42,9],[42,10,42,11],[42,12,42,13],[40,2,40,3],[40,4,40,5],[40,6,40,7],[40,8,40,9],[40,10,40,11],[40,12,40,13],[40,14,40,15],[40,17,40,18],[38,19,38,20],[38,21,38,22],[38,23,38,24],[38,25,38,26],[40,19,40,20],[40,21,40,22],[44,23,44,24],[44,25,44,26],[42,27,42,28],[42,29,42,30],[44,27,44,28],[44,29,44,30],[42,23,42,24],[42,25,42,26],[44,2,44,3],[44,4,44,5],[44,6,44,7],[44,8,44,9],[44,10,44,11],[44,12,44,13],[44,19,44,20],[44,21,44,22],[42,14,42,15],[42,17,42,18],[44,14,44,15],[44,17,44,18],[42,19,42,20],[42,21,42,22],[46,27,46,28],[46,29,46,30],[48,2,48,3],[48,4,48,5],[48,6,48,7],[48,8,48,9],[48,10,48,11],[48,12,48,13],[48,14,48,15],[46,2,46,3],[46,4,46,5],[46,6,46,7],[46,8,46,9],[46,10,46,11],[46,12,46,13],[46,25,46,26],[46,19,46,20],[46,21,46,22],[46,23,46,24],[48,21,48,22],[46,14,46,15],[46,17,46,18],[48,25,48,26],[48,27,48,28],[48,29,48,30],[50,25,50,26],[50,27,50,28],[50,29,50,30],[50,19,50,20],[48,23,48,24],[50,2,50,3],[50,4,50,5],[50,6,50,7],[50,8,50,9],[50,10,50,11],[48,17,48,18],[50,17,50,18],[50,21,50,22],[48,19,48,20],[50,14,50,15],[55,25,55,26],[55,27,55,28],[51,2,51,10],[51,11,51,15],[51,17,51,25],[50,12,50,13],[51,26,51,30],[50,23,50,24],[53,26,53,30],[55,2,55,3],[55,4,55,5],[55,6,55,7],[55,8,55,9],[55,10,55,11],[55,12,55,13],[55,14,55,15],[53,2,53,6],[53,7,53,9],[53,11,53,15],[53,17,53,21],[53,22,53,24],[55,29,55,30],[55,21,55,22],[55,23,55,24],[55,17,55,18],[55,19,55,20],[57,29,57,30],[59,2,59,3],[59,4,59,5],[59,6,59,7],[59,8,59,9],[59,10,59,11],[59,12,59,13],[59,14,59,15],[57,25,57,26],[57,27,57,28],[59,29,59,30],[59,21,59,22],[59,23,59,24],[59,17,59,18],[59,19,59,20],[57,2,57,3],[57,4,57,5],[57,6,57,7],[57,8,57,9],[57,10,57,11],[57,12,57,13],[57,14,57,15],[57,17,57,18],[57,19,57,20],[61,21,61,22],[61,23,61,24],[59,25,59,26],[59,27,59,28],[61,29,61,30],[57,21,57,22],[57,23,57,24],[63,8,63,9],[63,10,63,11],[63,12,63,13],[63,14,63,15],[61,25,61,26],[61,27,61,28],[61,2,61,3],[61,4,61,5],[61,6,61,7],[61,8,61,9],[61,10,61,11],[61,12,61,13],[61,14,61,15],[61,17,61,18],[61,19,61,20],[65,25,65,26],[65,27,65,28],[63,29,63,30],[65,2,65,3],[65,4,65,5],[65,6,65,7],[65,8,65,9],[65,10,65,11],[65,29,65,30],[65,12,65,13],[65,14,65,15],[65,17,65,18],[65,19,65,20],[63,21,63,22],[63,23,63,24],[63,17,63,18],[63,19,63,20],[65,21,65,22],[65,23,65,24],[63,25,63,26],[63,27,63,28],[63,2,63,3],[63,4,63,5],[63,6,63,7],[67,14,67,15],[67,17,67,18],[67,27,67,28],[67,29,67,30],[68,2,68,10],[68,11,68,15],[68,17,68,25],[68,26,68,30],[67,19,67,20],[67,21,67,22],[67,2,67,3],[67,4,67,5],[67,6,67,7],[67,8,67,9],[67,10,67,11],[67,12,67,13],[67,23,67,24],[67,25,67,26],[72,23,72,24],[72,25,72,26],[70,22,70,24],[70,26,70,30],[72,27,72,28],[72,29,72,30],[72,6,72,7],[72,8,72,9],[72,10,72,11],[72,12,72,13],[72,19,72,20],[72,21,72,22],[72,14,72,15],[72,17,72,18],[70,2,70,6],[70,7,70,9],[70,11,70,15],[70,17,70,21],[72,2,72,3],[72,4,72,5],[76,2,76,3],[76,4,76,5],[76,6,76,7],[76,8,76,9],[76,10,76,11],[76,12,76,13],[76,19,76,20],[76,21,76,22],[74,14,74,15],[74,17,74,18],[76,14,76,15],[76,17,76,18],[74,19,74,20],[74,21,74,22],[74,2,74,3],[74,4,74,5],[74,6,74,7],[74,8,74,9],[74,10,74,11],[74,12,74,13],[78,8,78,9],[78,10,78,11],[78,12,78,13],[76,23,76,24],[76,25,76,26],[74,27,74,28],[74,29,74,30],[76,27,76,28],[76,29,76,30],[74,23,74,24],[74,25,74,26],[80,25,80,26],[78,27,78,28],[78,29,78,30],[80,27,80,28],[80,29,80,30],[78,23,78,24],[78,25,78,26],[80,2,80,3],[80,4,80,5],[80,6,80,7],[80,8,80,9],[80,10,80,11],[80,12,80,13],[80,19,80,20],[80,21,80,22],[78,14,78,15],[78,17,78,18],[80,14,80,15],[80,17,80,18],[78,19,78,20],[78,21,78,22],[78,2,78,3],[78,4,78,5],[78,6,78,7],[82,19,82,20],[82,21,82,22],[82,2,82,3],[82,4,82,5],[82,6,82,7],[82,8,82,9],[82,10,82,11],[82,12,82,13],[80,23,80,24],[84,23,84,24],[84,25,84,26],[82,27,82,28],[82,29,82,30],[87,2,87,6],[87,7,87,9],[87,11,87,15],[87,17,87,21],[84,27,84,28],[84,29,84,30],[82,23,82,24],[82,25,82,26],[84,2,84,3],[84,4,84,5],[84,6,84,7],[84,8,84,9],[84,10,84,11],[84,12,84,13],[84,19,84,20],[84,21,84,22],[82,14,82,15],[82,17,82,18],[84,14,84,15],[84,17,84,18],[89,6,89,7],[89,8,89,9],[89,10,89,11],[89,12,89,13],[85,2,85,10],[85,11,85,15],[85,17,85,25],[85,26,85,30],[87,22,87,24],[87,26,87,30],[91,23,91,24],[91,25,91,26],[89,27,89,28],[89,29,89,30],[91,27,91,28],[91,29,91,30],[89,23,89,24],[89,25,89,26],[91,2,91,3],[91,4,91,5],[91,6,91,7],[91,8,91,9],[91,10,91,11],[91,12,91,13],[91,19,91,20],[91,21,91,22],[89,14,89,15],[89,17,89,18],[91,14,91,15],[91,17,91,18],[89,19,89,20],[89,21,89,22],[89,2,89,3],[89,4,89,5],[95,2,95,3],[95,4,95,5],[95,6,95,7],[95,8,95,9],[95,10,95,11],[95,12,95,13],[95,19,95,20],[95,21,95,22],[93,14,93,15],[93,17,93,18],[95,14,95,15],[95,17,95,18],[93,19,93,20],[93,21,93,22],[93,2,93,3],[93,4,93,5],[93,6,93,7],[93,8,93,9],[93,10,93,11],[93,12,93,13],[97,6,97,7],[97,8,97,9],[97,10,97,11],[97,12,97,13],[95,23,95,24],[95,25,95,26],[93,27,93,28],[93,29,93,30],[95,27,95,28],[95,29,95,30],[93,23,93,24],[93,25,93,26],[99,23,99,24],[99,25,99,26],[97,27,97,28],[97,29,97,30],[99,27,99,28],[99,29,99,30],[97,23,97,24],[97,25,97,26],[99,2,99,3],[99,4,99,5],[99,6,99,7],[99,8,99,9],[99,10,99,11],[99,12,99,13],[99,19,99,20],[99,21,99,22],[97,14,97,15],[97,17,97,18],[99,14,99,15],[99,17,99,18],[97,19,97,20],[97,21,97,22],[97,2,97,3],[97,4,97,5],[101,23,101,24],[101,25,101,26],[101,14,101,15],[101,17,101,18],[101,27,101,28],[101,29,101,30],[102,2,102,10],[102,11,102,15],[102,17,102,25],[102,26,102,30],[101,19,101,20],[101,21,101,22],[101,2,101,3],[101,4,101,5],[101,6,101,7],[101,8,101,9],[101,10,101,11],[101,12,101,13]]}
[]
[null,null,null,null,null,null,null,null,null,null,null,null,{"$f":"祝日!A3","v":2020}]
[{"$f":"DATE(祝日!A3,1,1)","v":"2020-01-01"},null,{"$f":"DATE(YEAR($A$3),H3,DAY($A$3))","v":"2020-01-01"},null,null,null,null,{"$f":"MONTH($A$3)","v":1},null,null,null,{"$f":"$M$2","v":2020},null,null,null,null,null,{"$f":"DATE(YEAR($A$3),W3,DAY($A$3))","v":"2020-07-01"},null,null,null,null,{"$f":"MONTH($A$3)+6","v":7},null,null,null,{"$f":"$M$2","v":2020}]
[]
[null,null,"日",null,"月",null,"火",null,"水",null,"木",null,"金",null,"土",null,null,"日",null,"月",null,"火",null,"水",null,"木",null,"金",null,"土"]
[null,null,{"$f":"IF(WEEKDAY(DATE(YEAR($A$3),H3,DAY($A$3)))=1,1,0)","v":0},null,{"$f":"IF(WEEKDAY(DATE(YEAR($A$3),H3,DAY($A$3)))=2,1,IF(C6>0,C6+1,0))","v":0},null,{"$f":"IF(WEEKDAY(DATE(YEAR($A$3),H3,DAY($A$3)))=3,1,IF(E6>0,E6+1,0))","v":0},null,{"$f":"IF(WEEKDAY(DATE(YEAR($A$3),H3,DAY($A$3)))=4,1,IF(G6>0,G6+1,0))","v":1},null,{"$f":"IF(WEEKDAY(DATE(YEAR($A$3),H3,DAY($A$3)))=5,1,IF(I6>0,I6+1,0))","v":2},null,{"$f":"IF(WEEKDAY(DATE(YEAR($A$3),H3,DAY($A$3)))=6,1,IF(K6>0,K6+1,0))","v":3},null,{"$f":"IF(WEEKDAY(DATE(YEAR($A$3),H3,DAY($A$3)))=7,1,IF(M6>0,M6+1,0))","v":4},null,null,{"$f":"IF(WEEKDAY(DATE(YEAR($A$3),W3,DAY($A$3)))=1,1,0)","v":0},null,{"$f":"IF(WEEKDAY(DATE(YEAR($A$3),W3,DAY($A$3)))=2,1,IF(R6>0,R6+1,0))","v":0},null,{"$f":"IF(WEEKDAY(DATE(YEAR($A$3),W3,DAY($A$3)))=3,1,IF(T6>0,T6+1,0))","v":0},null,{"$f":"IF(WEEKDAY(DATE(YEAR($A$3),W3,DAY($A$3)))=4,1,IF(V6>0,V6+1,0))","v":1},null,{"$f":"IF(WEEKDAY(DATE(YEAR($A$3),W3,DAY($A$3)))=5,1,IF(X6>0,X6+1,0))","v":2},null,{"$f":"IF(WEEKDAY(DATE(YEAR($A$3),W3,DAY($A$3)))=6,1,IF(Z6>0,Z6+1,0))","v":3},null,{"$f":"IF(WEEKDAY(DATE(YEAR($A$3),W3,DAY($A$3)))=7,1,IF(AB6>0,AB6+1,0))","v":4}]
[null,null,{"$f":"IF(ISERROR(VLOOKUP(DATE(YEAR($A$3),H3,C6),祝日!$C$6:$D$28,2,0)),\"\",VLOOKUP(DATE(YEAR($A$3),H3,C6),祝日!$C$6:$D$28,2,0))","v":""},null,{"$f":"IF(ISERROR(VLOOKUP(DATE(YEAR($A$3),H3,E6),祝日!$C$6:$D$28,2,0)),\"\",VLOOKUP(DATE(YEAR($A$3),H3,E6),祝日!$C$6:$D$28,2,0))","v":""},null,{"$f":"IF(ISERROR(VLOOKUP(DATE(YEAR($A$3),H3,G6),祝日!$C$6:$D$28,2,0)),\"\",VLOOKUP(DATE(YEAR($A$3),H3,G6),祝日!$C$6:$D$28,2,0))","v":""},null,{"$f":"IF(ISERROR(VLOOKUP(DATE(YEAR($A$3),H3,I6),祝日!$C$6:$D$28,2,0)),\"\",VLOOKUP(DATE(YEAR($A$3),H3,I6),祝日!$C$6:$D$28,2,0))","v":"元旦"},null,{"$f":"IF(ISERROR(VLOOKUP(DATE(YEAR($A$3),H3,K6),祝日!$C$6:$D$28,2,0)),\"\",VLOOKUP(DATE(YEAR($A$3),H3,K6),祝日!$C$6:$D$28,2,0))","v":""},null,{"$f":"IF(ISERROR(VLOOKUP(DATE(YEAR($A$3),H3,M6),祝日!$C$6:$D$28,2,0)),\"\",VLOOKUP(DATE(YEAR($A$3),H3,M6),祝日!$C$6:$D$28,2,0))","v":""},null,{"$f":"IF(ISERROR(VLOOKUP(DATE(YEAR($A$3),H3,O6),祝日!$C$6:$D$28,2,0)),\"\",VLOOKUP(DATE(YEAR($A$3),H3,O6),祝日!$C$6:$D$28,2,0))","v":""},null,null,{"$f":"IF(ISERROR(VLOOKUP(DATE(YEAR($A$3),W3,R6),祝日!$C$6:$D$28,2,0)),\"\",VLOOKUP(DATE(YEAR($A$3),W3,R6),祝日!$C$6:$D$28,2,0))","v":""},null,{"$f":"IF(ISERROR(VLOOKUP(DATE(YEAR($A$3),W3,T6),祝日!$C$6:$D$28,2,0)),\"\",VLOOKUP(DATE(YEAR($A$3),W3,T6),祝日!$C$6:$D$28,2,0))","v":""},null,{"$f":"IF(ISERROR(VLOOKUP(DATE(YEAR($A$3),W3,V6),祝日!$C$6:$D$28,2,0)),\"\",VLOOKUP(DATE(YEAR($A$3),W3,V6),祝日!$C$6:$D$28,2,0))","v":""},null,{"$f":"IF(ISERROR(VLOOKUP(DATE(YEAR($A$3),W3,X6),祝日!$C$6:$D$28,2,0)),\"\",VLOOKUP(DATE(YEAR($A$3),W3,X6),祝日!$C$6:$D$28,2,0))","v":""},null,{"$f":"IF(ISERROR(VLOOKUP(DATE(YEAR($A$3),W3,Z6),祝日!$C$6:$D$28,2,0)),\"\",VLOOKUP(DATE(YEAR($A$3),W3,Z6),祝日!$C$6:$D$28,2,0))","v":""},null,{"$f":"IF(ISERROR(VLOOKUP(DATE(YEAR($A$3),W3,AB6),祝日!$C$6:$D$28,2,0)),\"\",VLOOKUP(DATE(YEAR($A$3),W3,AB6),祝日!$C$6:$D$28,2,0))","v":""},null,{"$f":"IF(ISERROR(VLOOKUP(DATE(YEAR($A$3),W3,AD6),祝日!$C$6:$D$28,2,0)),\"\",VLOOKUP(DATE(YEAR($A$3),W3,AD6),祝日!$C$6:$D$28,2,0))","v":""}]
[null,null,{"$f":"O6+1","v":5},{"$f":"IF(ISERROR(VLOOKUP(DATE(YEAR($A$3),H3,C8),祝日!$C$6:$D$28,3,0)),\"\",(VLOOKUP(DATE(YEAR($A$3),H3,C8),祝日!$C$6:$D$28,3,0)))","v":""},{"$f":"C8+1","v":6},null,{"$f":"E8+1","v":7},null,{"$f":"G8+1","v":8},null,{"$f":"I8+1","v":9},null,{"$f":"K8+1","v":10},null,{"$f":"M8+1","v":11},null,null,{"$f":"AD6+1","v":5},{"$f":"IF(ISERROR(VLOOKUP(DATE(YEAR($A$3),W3,R8),祝日!$C$6:$D$28,3,0)),\"\",(VLOOKUP(DATE(YEAR($A$3),W3,R8),祝日!$C$6:$D$28,3,0)))","v":""},{"$f":"R8+1","v":6},null,{"$f":"T8+1","v":7},null,{"$f":"V8+1","v":8},null,{"$f":"X8+1","v":9},null,{"$f":"Z8+1","v":10},null,{"$f":"AB8+1","v":11}]
[null,null,{"$f":"IF(ISERROR(VLOOKUP(DATE(YEAR($A$3),H3,C8),祝日!$C$6:$D$28,2,0)),\"\",VLOOKUP(DATE(YEAR($A$3),H3,C8),祝日!$C$6:$D$28,2,0))","v":""},null,{"$f":"IF(AND(H3=1,E6>0),祝日!$D$7,IF(ISERROR(VLOOKUP(DATE(YEAR($A$3),H3,E8),祝日!$C$6:$D$28,2,0)),\"\",VLOOKUP(DATE(YEAR($A$3),H3,E8),祝日!$C$6:$D$28,2,0)))","v":""},null,{"$f":"IF(ISERROR(VLOOKUP(DATE(YEAR($A$3),H3,G8),祝日!$C$6:$D$28,2,0)),\"\",VLOOKUP(DATE(YEAR($A$3),H3,G8),祝日!$C$6:$D$28,2,0))","v":""},null,{"$f":"IF(ISERROR(VLOOKUP(DATE(YEAR($A$3),H3,I8),祝日!$C$6:$D$28,2,0)),\"\",VLOOKUP(DATE(YEAR($A$3),H3,I8),祝日!$C$6:$D$28,2,0))","v":""},null,{"$f":"IF(ISERROR(VLOOKUP(DATE(YEAR($A$3),H3,K8),祝日!$C$6:$D$28,2,0)),\"\",VLOOKUP(DATE(YEAR($A$3),H3,K8),祝日!$C$6:$D$28,2,0))","v":""},null,{"$f":"IF(ISERROR(VLOOKUP(DATE(YEAR($A$3),H3,M8),祝日!$C$6:$D$28,2,0)),\"\",VLOOKUP(DATE(YEAR($A$3),H3,M8),祝日!$C$6:$D$28,2,0))","v":""},null,{"$f":"IF(ISERROR(VLOOKUP(DATE(YEAR($A$3),H3,O8),祝日!$C$6:$D$28,2,0)),\"\",VLOOKUP(DATE(YEAR($A$3),H3,O8),祝日!$C$6:$D$28,2,0))","v":""},null,null,{"$f":"IF(ISERROR(VLOOKUP(DATE(YEAR($A$3),W3,R8),祝日!$C$6:$D$28,2,0)),\"\",VLOOKUP(DATE(YEAR($A$3),W3,R8),祝日!$C$6:$D$28,2,0))","v":""},null,{"$f":"IF(ISERROR(VLOOKUP(DATE(YEAR($A$3),W3,T8),祝日!$C$6:$D$28,2,0)),\"\",VLOOKUP(DATE(YEAR($A$3),W3,T8),祝日!$C$6:$D$28,2,0))","v":""},null,{"$f":"IF(ISERROR(VLOOKUP(DATE(YEAR($A$3),W3,V8),祝日!$C$6:$D$28,2,0)),\"\",VLOOKUP(DATE(YEAR($A$3),W3,V8),祝日!$C$6:$D$28,2,0))","v":""},null,{"$f":"IF(ISERROR(VLOOKUP(DATE(YEAR($A$3),W3,X8),祝日!$C$6:$D$28,2,0)),\"\",VLOOKUP(DATE(YEAR($A$3),W3,X8),祝日!$C$6:$D$28,2,0))","v":""},null,{"$f":"IF(ISERROR(VLOOKUP(DATE(YEAR($A$3),W3,Z8),祝日!$C$6:$D$28,2,0)),\"\",VLOOKUP(DATE(YEAR($A$3),W3,Z8),祝日!$C$6:$D$28,2,0))","v":""},null,{"$f":"IF(ISERROR(VLOOKUP(DATE(YEAR($A$3),W3,AB8),祝日!$C$6:$D$28,2,0)),\"\",VLOOKUP(DATE(YEAR($A$3),W3,AB8),祝日!$C$6:$D$28,2,0))","v":""},null,{"$f":"IF(ISERROR(VLOOKUP(DATE(YEAR($A$3),W3,AD8),祝日!$C$6:$D$28,2,0)),\"\",VLOOKUP(DATE(YEAR($A$3),W3,AD8),祝日!$C$6:$D$28,2,0))","v":""}]
[null,null,{"$f":"O8+1","v":12},null,{"$f":"C10+1","v":13},null,{"$f":"E10+1","v":14},null,{"$f":"G10+1","v":15},null,{"$f":"I10+1","v":16},null,{"$f":"K10+1","v":17},null,{"$f":"M10+1","v":18},null,null,{"$f":"AD8+1","v":12},null,{"$f":"R10+1","v":13},null,{"$f":"T10+1","v":14},null,{"$f":"V10+1","v":15},null,{"$f":"X10+1","v":16},null,{"$f":"Z10+1","v":17},null,{"$f":"AB10+1","v":18}]
{"$rows_left_out":93}